BDBM31469 substituted biphenyl derivative, 36i
SMILES CC#Cc1ccc(c(c1)C(=O)Nc1ccc(cc1)C(N)=N)-c1ccc(cc1C(O)=O)C(=O)NCC(C)C
InChI Key InChIKey=FNPAYHPYLXUHPD-UHFFFAOYSA-N
Data  5 IC50
  Tab Delimited (TSV)   2D SDfile   Computed 3D by Vconf -m prep SDfile
Find this compound or compounds like it in BindingDB:
Activity Spreadsheet -- Enzyme Inhibition Constant Data from BindingDB
Found 1 hit for monomerid = 31469
TargetSerine protease 1(Bos taurus (bovine))
Biocryst Pharmaceuticals
LigandPNGBDBM31469(substituted biphenyl derivative, 36i)
Affinity DataIC50:  1.66E+3nMT: 2°C. Assay description: Trypsin assay reactions were performed in a mixture containing trypsin, and test compounds were added at varied concentrations. The reactions were in...
In DepthDetails ArticlePubMed